seduction
 Language:
Welcome, Guest. Please login or register.
Did you miss your activation email?
2019/08/19, 09:41:45


Help

Author [EN] [PL] [ES] [PT] [IT] [DE] [FR] [NL] [TR] [SR] [AR] [RU] Topic: Kernel Serie 5.1.x + Displaylink  (Read 229 times)

0 Members and 1 Guest are viewing this topic.

Offline zash1958

  • User
  • Posts: 83
Kernel Serie 5.1.x + Displaylink
« on: 2019/05/15, 17:24:05 »
Hallo,

nachdem mein Display-Link Adapter auf den Kerneln 5.0.x absolut stabil und sauber gelaufen ist tut das unter 5.1 nicht mehr.
Die Kompilation des Displaylink Adapters bricht mit einer Fehlermeldung zu EVDI ab.

Hat da jemand eine Idee? Soll ich das Fehlerlog hier mal reinwerfen? Oder hat der Kernel 5.1 generell keinen Support für Displaylink?

« Last Edit: 2019/05/15, 17:30:30 by zash1958 »

Offline zash1958

  • User
  • Posts: 83
Re: Kernel Serie 5.1.x + Displaylink
« Reply #1 on: 2019/05/15, 17:31:32 »
Ich kippe das Logfile mal hier rein:

Code: [Select]
DKMS make.log for evdi-5.1.26 for kernel 5.1.2-towo.1-siduction-amd64 (x86_64)
Mi 15. Mai 17:25:58 CEST 2019
make KBUILD_VERBOSE=1 SUBDIRS=/var/lib/dkms/evdi/5.1.26/build SRCROOT=/var/lib/dkms/evdi/5.1.26/build CONFIG_MODULE_SIG= -C /lib/modules/5.1.2-towo.1-siduction-amd64/build modules
make[1]: Verzeichnis „/usr/src/linux-headers-5.1.2-towo.1-siduction-amd64“ wird betreten
Makefile:205: ================= WARNING ================
Makefile:206: 'SUBDIRS' will be removed after Linux 5.3
Makefile:207: Please use 'M=' or 'KBUILD_EXTMOD' instead
Makefile:208: ==========================================
test -e include/generated/autoconf.h -a -e include/config/auto.conf || (        \
echo >&2;                            \
echo >&2 "  ERROR: Kernel configuration is invalid.";        \
echo >&2 "         include/generated/autoconf.h or include/config/auto.conf are missing.";\
echo >&2 "         Run 'make oldconfig && make prepare' on kernel src to fix it.";    \
echo >&2 ;                            \
/bin/false)
mkdir -p /var/lib/dkms/evdi/5.1.26/build/.tmp_versions ; rm -f /var/lib/dkms/evdi/5.1.26/build/.tmp_versions/*
make -f ./scripts/Makefile.build obj=/var/lib/dkms/evdi/5.1.26/build
   gcc-8 -Wp,-MD,/var/lib/dkms/evdi/5.1.26/build/.evdi_drv.o.d  -nostdinc -isystem /usr/lib/gcc/x86_64-linux-gnu/8/include -I./arch/x86/include -I./arch/x86/include/generated  -I./include -I./arch/x86/include/uapi -I./arch/x86/include/generated/uapi -I./include/uapi -I./include/generated/uapi -include ./include/linux/kconfig.h -include ./include/linux/compiler_types.h -D__KERNEL__ -Wall -Wundef -Werror=strict-prototypes -Wno-trigraphs -fno-strict-aliasing -fno-common -fshort-wchar -fno-PIE -Werror=implicit-function-declaration -Werror=implicit-int -Wno-format-security -std=gnu89 -mno-sse -mno-mmx -mno-sse2 -mno-3dnow -mno-avx -m64 -falign-jumps=1 -falign-loops=1 -mno-80387 -mno-fp-ret-in-387 -mpreferred-stack-boundary=3 -mskip-rax-setup -mtune=generic -mno-red-zone -mcmodel=kernel -DCONFIG_AS_CFI=1 -DCONFIG_AS_CFI_SIGNAL_FRAME=1 -DCONFIG_AS_CFI_SECTIONS=1 -DCONFIG_AS_SSSE3=1 -DCONFIG_AS_AVX=1 -DCONFIG_AS_AVX2=1 -DCONFIG_AS_AVX512=1 -DCONFIG_AS_SHA1_NI=1 -DCONFIG_AS_SHA256_NI=1 -Wno-sign-compare -fno-asynchronous-unwind-tables -mindirect-branch=thunk-extern -mindirect-branch-register -fno-jump-tables -fno-delete-null-pointer-checks -Wno-frame-address -Wno-format-truncation -Wno-format-overflow -Wno-int-in-bool-context -O2 --param=allow-store-data-races=0 -Wframe-larger-than=2048 -fstack-protector-strong -Wno-unused-but-set-variable -Wno-unused-const-variable -fomit-frame-pointer -fno-var-tracking-assignments -Wdeclaration-after-statement -Wvla -Wno-pointer-sign -Wno-stringop-truncation -fno-strict-overflow -fno-merge-all-constants -fmerge-constants -fno-stack-check -fconserve-stack -Werror=date-time -Werror=incompatible-pointer-types -Werror=designated-init -fmacro-prefix-map=./= -Wno-packed-not-aligned -Iinclude/drm  -DMODULE  -DKBUILD_BASENAME='"evdi_drv"' -DKBUILD_MODNAME='"evdi"' -c -o /var/lib/dkms/evdi/5.1.26/build/evdi_drv.o /var/lib/dkms/evdi/5.1.26/build/evdi_drv.c
   gcc-8 -Wp,-MD,/var/lib/dkms/evdi/5.1.26/build/.evdi_modeset.o.d  -nostdinc -isystem /usr/lib/gcc/x86_64-linux-gnu/8/include -I./arch/x86/include -I./arch/x86/include/generated  -I./include -I./arch/x86/include/uapi -I./arch/x86/include/generated/uapi -I./include/uapi -I./include/generated/uapi -include ./include/linux/kconfig.h -include ./include/linux/compiler_types.h -D__KERNEL__ -Wall -Wundef -Werror=strict-prototypes -Wno-trigraphs -fno-strict-aliasing -fno-common -fshort-wchar -fno-PIE -Werror=implicit-function-declaration -Werror=implicit-int -Wno-format-security -std=gnu89 -mno-sse -mno-mmx -mno-sse2 -mno-3dnow -mno-avx -m64 -falign-jumps=1 -falign-loops=1 -mno-80387 -mno-fp-ret-in-387 -mpreferred-stack-boundary=3 -mskip-rax-setup -mtune=generic -mno-red-zone -mcmodel=kernel -DCONFIG_AS_CFI=1 -DCONFIG_AS_CFI_SIGNAL_FRAME=1 -DCONFIG_AS_CFI_SECTIONS=1 -DCONFIG_AS_SSSE3=1 -DCONFIG_AS_AVX=1 -DCONFIG_AS_AVX2=1 -DCONFIG_AS_AVX512=1 -DCONFIG_AS_SHA1_NI=1 -DCONFIG_AS_SHA256_NI=1 -Wno-sign-compare -fno-asynchronous-unwind-tables -mindirect-branch=thunk-extern -mindirect-branch-register -fno-jump-tables -fno-delete-null-pointer-checks -Wno-frame-address -Wno-format-truncation -Wno-format-overflow -Wno-int-in-bool-context -O2 --param=allow-store-data-races=0 -Wframe-larger-than=2048 -fstack-protector-strong -Wno-unused-but-set-variable -Wno-unused-const-variable -fomit-frame-pointer -fno-var-tracking-assignments -Wdeclaration-after-statement -Wvla -Wno-pointer-sign -Wno-stringop-truncation -fno-strict-overflow -fno-merge-all-constants -fmerge-constants -fno-stack-check -fconserve-stack -Werror=date-time -Werror=incompatible-pointer-types -Werror=designated-init -fmacro-prefix-map=./= -Wno-packed-not-aligned -Iinclude/drm  -DMODULE  -DKBUILD_BASENAME='"evdi_modeset"' -DKBUILD_MODNAME='"evdi"' -c -o /var/lib/dkms/evdi/5.1.26/build/evdi_modeset.o /var/lib/dkms/evdi/5.1.26/build/evdi_modeset.c
   gcc-8 -Wp,-MD,/var/lib/dkms/evdi/5.1.26/build/.evdi_connector.o.d  -nostdinc -isystem /usr/lib/gcc/x86_64-linux-gnu/8/include -I./arch/x86/include -I./arch/x86/include/generated  -I./include -I./arch/x86/include/uapi -I./arch/x86/include/generated/uapi -I./include/uapi -I./include/generated/uapi -include ./include/linux/kconfig.h -include ./include/linux/compiler_types.h -D__KERNEL__ -Wall -Wundef -Werror=strict-prototypes -Wno-trigraphs -fno-strict-aliasing -fno-common -fshort-wchar -fno-PIE -Werror=implicit-function-declaration -Werror=implicit-int -Wno-format-security -std=gnu89 -mno-sse -mno-mmx -mno-sse2 -mno-3dnow -mno-avx -m64 -falign-jumps=1 -falign-loops=1 -mno-80387 -mno-fp-ret-in-387 -mpreferred-stack-boundary=3 -mskip-rax-setup -mtune=generic -mno-red-zone -mcmodel=kernel -DCONFIG_AS_CFI=1 -DCONFIG_AS_CFI_SIGNAL_FRAME=1 -DCONFIG_AS_CFI_SECTIONS=1 -DCONFIG_AS_SSSE3=1 -DCONFIG_AS_AVX=1 -DCONFIG_AS_AVX2=1 -DCONFIG_AS_AVX512=1 -DCONFIG_AS_SHA1_NI=1 -DCONFIG_AS_SHA256_NI=1 -Wno-sign-compare -fno-asynchronous-unwind-tables -mindirect-branch=thunk-extern -mindirect-branch-register -fno-jump-tables -fno-delete-null-pointer-checks -Wno-frame-address -Wno-format-truncation -Wno-format-overflow -Wno-int-in-bool-context -O2 --param=allow-store-data-races=0 -Wframe-larger-than=2048 -fstack-protector-strong -Wno-unused-but-set-variable -Wno-unused-const-variable -fomit-frame-pointer -fno-var-tracking-assignments -Wdeclaration-after-statement -Wvla -Wno-pointer-sign -Wno-stringop-truncation -fno-strict-overflow -fno-merge-all-constants -fmerge-constants -fno-stack-check -fconserve-stack -Werror=date-time -Werror=incompatible-pointer-types -Werror=designated-init -fmacro-prefix-map=./= -Wno-packed-not-aligned -Iinclude/drm  -DMODULE  -DKBUILD_BASENAME='"evdi_connector"' -DKBUILD_MODNAME='"evdi"' -c -o /var/lib/dkms/evdi/5.1.26/build/evdi_connector.o /var/lib/dkms/evdi/5.1.26/build/evdi_connector.c
   gcc-8 -Wp,-MD,/var/lib/dkms/evdi/5.1.26/build/.evdi_encoder.o.d  -nostdinc -isystem /usr/lib/gcc/x86_64-linux-gnu/8/include -I./arch/x86/include -I./arch/x86/include/generated  -I./include -I./arch/x86/include/uapi -I./arch/x86/include/generated/uapi -I./include/uapi -I./include/generated/uapi -include ./include/linux/kconfig.h -include ./include/linux/compiler_types.h -D__KERNEL__ -Wall -Wundef -Werror=strict-prototypes -Wno-trigraphs -fno-strict-aliasing -fno-common -fshort-wchar -fno-PIE -Werror=implicit-function-declaration -Werror=implicit-int -Wno-format-security -std=gnu89 -mno-sse -mno-mmx -mno-sse2 -mno-3dnow -mno-avx -m64 -falign-jumps=1 -falign-loops=1 -mno-80387 -mno-fp-ret-in-387 -mpreferred-stack-boundary=3 -mskip-rax-setup -mtune=generic -mno-red-zone -mcmodel=kernel -DCONFIG_AS_CFI=1 -DCONFIG_AS_CFI_SIGNAL_FRAME=1 -DCONFIG_AS_CFI_SECTIONS=1 -DCONFIG_AS_SSSE3=1 -DCONFIG_AS_AVX=1 -DCONFIG_AS_AVX2=1 -DCONFIG_AS_AVX512=1 -DCONFIG_AS_SHA1_NI=1 -DCONFIG_AS_SHA256_NI=1 -Wno-sign-compare -fno-asynchronous-unwind-tables -mindirect-branch=thunk-extern -mindirect-branch-register -fno-jump-tables -fno-delete-null-pointer-checks -Wno-frame-address -Wno-format-truncation -Wno-format-overflow -Wno-int-in-bool-context -O2 --param=allow-store-data-races=0 -Wframe-larger-than=2048 -fstack-protector-strong -Wno-unused-but-set-variable -Wno-unused-const-variable -fomit-frame-pointer -fno-var-tracking-assignments -Wdeclaration-after-statement -Wvla -Wno-pointer-sign -Wno-stringop-truncation -fno-strict-overflow -fno-merge-all-constants -fmerge-constants -fno-stack-check -fconserve-stack -Werror=date-time -Werror=incompatible-pointer-types -Werror=designated-init -fmacro-prefix-map=./= -Wno-packed-not-aligned -Iinclude/drm  -DMODULE  -DKBUILD_BASENAME='"evdi_encoder"' -DKBUILD_MODNAME='"evdi"' -c -o /var/lib/dkms/evdi/5.1.26/build/evdi_encoder.o /var/lib/dkms/evdi/5.1.26/build/evdi_encoder.c
/var/lib/dkms/evdi/5.1.26/build/evdi_drv.c:45:11: error: initialization of ‘vm_fault_t (*)(struct vm_fault *)’ {aka ‘unsigned int (*)(struct vm_fault *)’} from incompatible pointer type ‘int (*)(struct vm_fault *)’ [-Werror=incompatible-pointer-types]
  .fault = evdi_gem_fault,
           ^~~~~~~~~~~~~~
/var/lib/dkms/evdi/5.1.26/build/evdi_drv.c:45:11: note: (near initialization for ‘evdi_gem_vm_ops.fault’)
   ./tools/objtool/objtool orc generate  --module --no-fp --retpoline /var/lib/dkms/evdi/5.1.26/build/evdi_encoder.o
/var/lib/dkms/evdi/5.1.26/build/evdi_connector.c:124:16: error: ‘drm_helper_probe_single_connector_modes’ undeclared here (not in a function); did you mean ‘drm_helper_move_panel_connectors_to_head’?
  .fill_modes = drm_helper_probe_single_connector_modes,
                ^~~~~~~~~~~~~~~~~~~~~~~~~~~~~~~~~~~~~~~
                drm_helper_move_panel_connectors_to_head
  if objdump -h /var/lib/dkms/evdi/5.1.26/build/evdi_encoder.o | grep -q __ksymtab; then  gcc-8 -E -D__GENKSYMS__ -Wp,-MD,/var/lib/dkms/evdi/5.1.26/build/.evdi_encoder.o.d  -nostdinc -isystem /usr/lib/gcc/x86_64-linux-gnu/8/include -I./arch/x86/include -I./arch/x86/include/generated  -I./include -I./arch/x86/include/uapi -I./arch/x86/include/generated/uapi -I./include/uapi -I./include/generated/uapi -include ./include/linux/kconfig.h -include ./include/linux/compiler_types.h -D__KERNEL__ -Wall -Wundef -Werror=strict-prototypes -Wno-trigraphs -fno-strict-aliasing -fno-common -fshort-wchar -fno-PIE -Werror=implicit-function-declaration -Werror=implicit-int -Wno-format-security -std=gnu89 -mno-sse -mno-mmx -mno-sse2 -mno-3dnow -mno-avx -m64 -falign-jumps=1 -falign-loops=1 -mno-80387 -mno-fp-ret-in-387 -mpreferred-stack-boundary=3 -mskip-rax-setup -mtune=generic -mno-red-zone -mcmodel=kernel -DCONFIG_AS_CFI=1 -DCONFIG_AS_CFI_SIGNAL_FRAME=1 -DCONFIG_AS_CFI_SECTIONS=1 -DCONFIG_AS_SSSE3=1 -DCONFIG_AS_AVX=1 -DCONFIG_AS_AVX2=1 -DCONFIG_AS_AVX512=1 -DCONFIG_AS_SHA1_NI=1 -DCONFIG_AS_SHA256_NI=1 -Wno-sign-compare -fno-asynchronous-unwind-tables -mindirect-branch=thunk-extern -mindirect-branch-register -fno-jump-tables -fno-delete-null-pointer-checks -Wno-frame-address -Wno-format-truncation -Wno-format-overflow -Wno-int-in-bool-context -O2 --param=allow-store-data-races=0 -Wframe-larger-than=2048 -fstack-protector-strong -Wno-unused-but-set-variable -Wno-unused-const-variable -fomit-frame-pointer -fno-var-tracking-assignments -Wdeclaration-after-statement -Wvla -Wno-pointer-sign -Wno-stringop-truncation -fno-strict-overflow -fno-merge-all-constants -fmerge-constants -fno-stack-check -fconserve-stack -Werror=date-time -Werror=incompatible-pointer-types -Werror=designated-init -fmacro-prefix-map=./= -Wno-packed-not-aligned -Iinclude/drm  -DMODULE  -DKBUILD_BASENAME='"evdi_encoder"' -DKBUILD_MODNAME='"evdi"' /var/lib/dkms/evdi/5.1.26/build/evdi_encoder.c | scripts/genksyms/genksyms    -r /dev/null > /var/lib/dkms/evdi/5.1.26/build/.tmp_evdi_encoder.ver; ld -m elf_x86_64  -z max-page-size=0x200000 -r -o /var/lib/dkms/evdi/5.1.26/build/.tmp_evdi_encoder.o /var/lib/dkms/evdi/5.1.26/build/evdi_encoder.o -T /var/lib/dkms/evdi/5.1.26/build/.tmp_evdi_encoder.ver; mv -f /var/lib/dkms/evdi/5.1.26/build/.tmp_evdi_encoder.o /var/lib/dkms/evdi/5.1.26/build/evdi_encoder.o; rm -f /var/lib/dkms/evdi/5.1.26/build/.tmp_evdi_encoder.ver; fi
   gcc-8 -Wp,-MD,/var/lib/dkms/evdi/5.1.26/build/.evdi_main.o.d  -nostdinc -isystem /usr/lib/gcc/x86_64-linux-gnu/8/include -I./arch/x86/include -I./arch/x86/include/generated  -I./include -I./arch/x86/include/uapi -I./arch/x86/include/generated/uapi -I./include/uapi -I./include/generated/uapi -include ./include/linux/kconfig.h -include ./include/linux/compiler_types.h -D__KERNEL__ -Wall -Wundef -Werror=strict-prototypes -Wno-trigraphs -fno-strict-aliasing -fno-common -fshort-wchar -fno-PIE -Werror=implicit-function-declaration -Werror=implicit-int -Wno-format-security -std=gnu89 -mno-sse -mno-mmx -mno-sse2 -mno-3dnow -mno-avx -m64 -falign-jumps=1 -falign-loops=1 -mno-80387 -mno-fp-ret-in-387 -mpreferred-stack-boundary=3 -mskip-rax-setup -mtune=generic -mno-red-zone -mcmodel=kernel -DCONFIG_AS_CFI=1 -DCONFIG_AS_CFI_SIGNAL_FRAME=1 -DCONFIG_AS_CFI_SECTIONS=1 -DCONFIG_AS_SSSE3=1 -DCONFIG_AS_AVX=1 -DCONFIG_AS_AVX2=1 -DCONFIG_AS_AVX512=1 -DCONFIG_AS_SHA1_NI=1 -DCONFIG_AS_SHA256_NI=1 -Wno-sign-compare -fno-asynchronous-unwind-tables -mindirect-branch=thunk-extern -mindirect-branch-register -fno-jump-tables -fno-delete-null-pointer-checks -Wno-frame-address -Wno-format-truncation -Wno-format-overflow -Wno-int-in-bool-context -O2 --param=allow-store-data-races=0 -Wframe-larger-than=2048 -fstack-protector-strong -Wno-unused-but-set-variable -Wno-unused-const-variable -fomit-frame-pointer -fno-var-tracking-assignments -Wdeclaration-after-statement -Wvla -Wno-pointer-sign -Wno-stringop-truncation -fno-strict-overflow -fno-merge-all-constants -fmerge-constants -fno-stack-check -fconserve-stack -Werror=date-time -Werror=incompatible-pointer-types -Werror=designated-init -fmacro-prefix-map=./= -Wno-packed-not-aligned -Iinclude/drm  -DMODULE  -DKBUILD_BASENAME='"evdi_main"' -DKBUILD_MODNAME='"evdi"' -c -o /var/lib/dkms/evdi/5.1.26/build/evdi_main.o /var/lib/dkms/evdi/5.1.26/build/evdi_main.c
make[2]: *** [scripts/Makefile.build:281: /var/lib/dkms/evdi/5.1.26/build/evdi_connector.o] Fehler 1
make[2]: *** Es wird auf noch nicht beendete Prozesse gewartet....
cc1: some warnings being treated as errors
make[2]: *** [scripts/Makefile.build:281: /var/lib/dkms/evdi/5.1.26/build/evdi_drv.o] Fehler 1
   ./tools/objtool/objtool orc generate  --module --no-fp --retpoline /var/lib/dkms/evdi/5.1.26/build/evdi_modeset.o
  if objdump -h /var/lib/dkms/evdi/5.1.26/build/evdi_modeset.o | grep -q __ksymtab; then  gcc-8 -E -D__GENKSYMS__ -Wp,-MD,/var/lib/dkms/evdi/5.1.26/build/.evdi_modeset.o.d  -nostdinc -isystem /usr/lib/gcc/x86_64-linux-gnu/8/include -I./arch/x86/include -I./arch/x86/include/generated  -I./include -I./arch/x86/include/uapi -I./arch/x86/include/generated/uapi -I./include/uapi -I./include/generated/uapi -include ./include/linux/kconfig.h -include ./include/linux/compiler_types.h -D__KERNEL__ -Wall -Wundef -Werror=strict-prototypes -Wno-trigraphs -fno-strict-aliasing -fno-common -fshort-wchar -fno-PIE -Werror=implicit-function-declaration -Werror=implicit-int -Wno-format-security -std=gnu89 -mno-sse -mno-mmx -mno-sse2 -mno-3dnow -mno-avx -m64 -falign-jumps=1 -falign-loops=1 -mno-80387 -mno-fp-ret-in-387 -mpreferred-stack-boundary=3 -mskip-rax-setup -mtune=generic -mno-red-zone -mcmodel=kernel -DCONFIG_AS_CFI=1 -DCONFIG_AS_CFI_SIGNAL_FRAME=1 -DCONFIG_AS_CFI_SECTIONS=1 -DCONFIG_AS_SSSE3=1 -DCONFIG_AS_AVX=1 -DCONFIG_AS_AVX2=1 -DCONFIG_AS_AVX512=1 -DCONFIG_AS_SHA1_NI=1 -DCONFIG_AS_SHA256_NI=1 -Wno-sign-compare -fno-asynchronous-unwind-tables -mindirect-branch=thunk-extern -mindirect-branch-register -fno-jump-tables -fno-delete-null-pointer-checks -Wno-frame-address -Wno-format-truncation -Wno-format-overflow -Wno-int-in-bool-context -O2 --param=allow-store-data-races=0 -Wframe-larger-than=2048 -fstack-protector-strong -Wno-unused-but-set-variable -Wno-unused-const-variable -fomit-frame-pointer -fno-var-tracking-assignments -Wdeclaration-after-statement -Wvla -Wno-pointer-sign -Wno-stringop-truncation -fno-strict-overflow -fno-merge-all-constants -fmerge-constants -fno-stack-check -fconserve-stack -Werror=date-time -Werror=incompatible-pointer-types -Werror=designated-init -fmacro-prefix-map=./= -Wno-packed-not-aligned -Iinclude/drm  -DMODULE  -DKBUILD_BASENAME='"evdi_modeset"' -DKBUILD_MODNAME='"evdi"' /var/lib/dkms/evdi/5.1.26/build/evdi_modeset.c | scripts/genksyms/genksyms    -r /dev/null > /var/lib/dkms/evdi/5.1.26/build/.tmp_evdi_modeset.ver; ld -m elf_x86_64  -z max-page-size=0x200000 -r -o /var/lib/dkms/evdi/5.1.26/build/.tmp_evdi_modeset.o /var/lib/dkms/evdi/5.1.26/build/evdi_modeset.o -T /var/lib/dkms/evdi/5.1.26/build/.tmp_evdi_modeset.ver; mv -f /var/lib/dkms/evdi/5.1.26/build/.tmp_evdi_modeset.o /var/lib/dkms/evdi/5.1.26/build/evdi_modeset.o; rm -f /var/lib/dkms/evdi/5.1.26/build/.tmp_evdi_modeset.ver; fi
/var/lib/dkms/evdi/5.1.26/build/evdi_main.c: In function ‘evdi_driver_setup’:
/var/lib/dkms/evdi/5.1.26/build/evdi_main.c:54:2: error: implicit declaration of function ‘drm_kms_helper_poll_init’; did you mean ‘drm_modeset_lock_init’? [-Werror=implicit-function-declaration]
  drm_kms_helper_poll_init(dev);
  ^~~~~~~~~~~~~~~~~~~~~~~~
  drm_modeset_lock_init
/var/lib/dkms/evdi/5.1.26/build/evdi_main.c: In function ‘evdi_driver_unload’:
/var/lib/dkms/evdi/5.1.26/build/evdi_main.c:95:2: error: implicit declaration of function ‘drm_kms_helper_poll_fini’; did you mean ‘drm_modeset_lock_fini’? [-Werror=implicit-function-declaration]
  drm_kms_helper_poll_fini(dev);
  ^~~~~~~~~~~~~~~~~~~~~~~~
  drm_modeset_lock_fini
cc1: some warnings being treated as errors
make[2]: *** [scripts/Makefile.build:280: /var/lib/dkms/evdi/5.1.26/build/evdi_main.o] Fehler 1
make[1]: *** [Makefile:1585: _module_/var/lib/dkms/evdi/5.1.26/build] Fehler 2
make[1]: Verzeichnis „/usr/src/linux-headers-5.1.2-towo.1-siduction-amd64“ wird verlassen
make: *** [Makefile:22: all] Fehler 2

Offline towo

  • Global Moderator
  • User
  • *****
  • Posts: 2.289
Re: Kernel Serie 5.1.x + Displaylink
« Reply #2 on: 2019/05/15, 20:17:49 »
Es wird wohl so sein, dass evdi-dkms nicht kompatibel zu kernel 5.1.x ist. Da wirst du wohl entweder auf eine aktualisierte version warten müssen, bis eine aktualisierte version verfügbar ist, oder gucken, ob es einen patch gibt.
Ich gehe nicht zum Karneval, ich verleihe nur manchmal mein Gesicht.

Offline zash1958

  • User
  • Posts: 83
Re: Kernel Serie 5.1.x + Displaylink
« Reply #3 on: 2019/05/25, 23:46:18 »
Problem gelöst: Es steht ein aktualiserter Treiber/Modul für EVDI zur Verfügung ... damit tut es wieder.

Danke sehr