seduction
 Language:
Welcome, Guest. Please login or register.
Did you miss your activation email?
2019/11/12, 14:53:24


Help

Author [EN] [PL] [ES] [PT] [IT] [DE] [FR] [NL] [TR] [SR] [AR] [RU] Topic: 3.10 kernel and Nvidia  (Read 13065 times)

0 Members and 1 Guest are viewing this topic.

Offline clubex

  • User
  • Posts: 265
3.10 kernel and Nvidia
« on: 2013/07/03, 13:20:20 »
Today's du gives
Code: [Select]

Error! Bad return status for module build on kernel 3.10-0.towo-siduction-amd64 (x86_64)
Sonsult /var/lib/dkms/nvidia/319.23/build/make.log for more infromation.


Which results in the inability to boot to the desktop (in my case KDE).

Offline Gabriel_M

  • User
  • Posts: 33
RE: 3.10 kernel and Nvidia
« Reply #1 on: 2013/07/03, 14:34:22 »
Please, put the contents of the file /var/lib/dkms/nvidia/319.23/build/make.log

Thanks in advance

Offline musca

  • Global Moderator
  • User
  • *****
  • Posts: 725
  • sid, fly high!
RE: 3.10 kernel and Nvidia
« Reply #2 on: 2013/07/03, 15:05:37 »
Hi clubex!
The proprietary fglrx and nvidia drivers must accomplish the changes of the new kernel 3.10 release.
Did you add the siduction experimental repo? see http://packages.siduction.org/

At least there is an experimental nvidia driver manually patched by towo`.
Be aware of its experimental status!

Code: [Select]
# LC_ALL=C apt-cache policy nvidia-kernel-dkms
nvidia-kernel-dkms:
  Installed: 319.32-0.siduction.1
  Candidate: 319.32-0.siduction.1
  Version table:
 *** 319.32-0.siduction.1 0
        100 http://packages.siduction.org/experimental/ unstable/non-free amd64 Packages
        100 /var/lib/dpkg/status
     304.88-3 0
        500 http://http.debian.net/debian/ unstable/non-free amd64 Packages


have fun!
musca
„Es irrt der Mensch, solang er strebt.“  (Goethe, Faust)

Offline clubex

  • User
  • Posts: 265
RE: 3.10 kernel and Nvidia
« Reply #3 on: 2013/07/03, 15:44:31 »
musca: Yeas I was going to try that when I have time later today.

Gabriel_M: I'll post it when I can. At the moment I'm using a 3.9 kernel.
But I suspect is is as musca intimates that we must wait for Nvidia to produce a driver compatible to the 3.10 kernel.

Offline clubex

  • User
  • Posts: 265
RE: 3.10 kernel and Nvidia
« Reply #4 on: 2013/07/03, 16:20:52 »
/var/lib/dkms/nvidia/319.23/build/make.log


Code: [Select]

DKMS make.log for nvidia-319.23 for kernel 3.10-0.towo-siduction-amd64 (x86_64)
Wed  3 Jul 11:58:52 BST 2013
make: Entering directory `/var/lib/dkms/nvidia/319.23/build'
make -C /lib/modules/3.10-0.towo-siduction-amd64/build  M=`/bin/pwd` modules
make[1]: Entering directory `/usr/src/linux-headers-3.10-0.towo-siduction-amd64'
  CC [M]  /var/lib/dkms/nvidia/319.23/build/nv.o
In file included from /usr/src/linux-headers-3.10-0.towo-siduction-amd64/arch/x86/include/asm/bitops.h:514:0,
                 from include/linux/bitops.h:22,
                 from include/linux/kernel.h:10,
                 from include/linux/sched.h:15,
                 from include/linux/utsname.h:5,
                 from /var/lib/dkms/nvidia/319.23/build/nv-linux.h:46,
                 from /var/lib/dkms/nvidia/319.23/build/nv.c:13:
include/linux/bitops.h: In function ‘hweight_long’:
include/asm-generic/bitops/const_hweight.h:27:70: warning: signed and unsigned type in conditional expression [-Wsign-compare]
 #define hweight64(w) (__builtin_constant_p(w) ? __const_hweight64(w) : __arch_hweight64(w))
                                                                      ^
include/linux/bitops.h:66:41: note: in expansion of macro ‘hweight64’
  return sizeof(w) == 4 ? hweight32(w) : hweight64(w);
                                         ^
In file included from /usr/src/linux-headers-3.10-0.towo-siduction-amd64/arch/x86/include/asm/cpumask.h:4:0,
                 from /usr/src/linux-headers-3.10-0.towo-siduction-amd64/arch/x86/include/asm/msr.h:10,
                 from /usr/src/linux-headers-3.10-0.towo-siduction-amd64/arch/x86/include/asm/processor.h:20,
                 from /usr/src/linux-headers-3.10-0.towo-siduction-amd64/arch/x86/include/asm/thread_info.h:22,
                 from include/linux/thread_info.h:54,
                 from include/linux/preempt.h:9,
                 from include/linux/spinlock.h:50,
                 from include/linux/seqlock.h:29,
                 from include/linux/time.h:5,
                 from include/uapi/linux/timex.h:56,
                 from include/linux/timex.h:56,
                 from include/linux/sched.h:17,
                 from include/linux/utsname.h:5,
                 from /var/lib/dkms/nvidia/319.23/build/nv-linux.h:46,
                 from /var/lib/dkms/nvidia/319.23/build/nv.c:13:
include/linux/cpumask.h: In function ‘cpumask_parse’:
include/linux/cpumask.h:603:26: warning: signed and unsigned type in conditional expression [-Wsign-compare]
  int len = nl ? nl - buf : strlen(buf);
                          ^
In file included from include/uapi/linux/stddef.h:1:0,
                 from include/linux/stddef.h:4,
                 from /usr/src/linux-headers-3.10-0.towo-siduction-amd64/include/uapi/linux/posix_types.h:4,
                 from include/uapi/linux/types.h:13,
                 from include/linux/types.h:5,
                 from include/uapi/linux/capability.h:16,
                 from include/linux/capability.h:15,
                 from include/linux/sched.h:13,
                 from include/linux/utsname.h:5,
                 from /var/lib/dkms/nvidia/319.23/build/nv-linux.h:46,
                 from /var/lib/dkms/nvidia/319.23/build/nv.c:13:
/usr/src/linux-headers-3.10-0.towo-siduction-amd64/arch/x86/include/asm/uaccess_64.h: In function ‘copy_from_user’:
/usr/src/linux-headers-3.10-0.towo-siduction-amd64/arch/x86/include/asm/uaccess_64.h:62:28: warning: comparison between signed and unsigned integer expressions [-Wsign-compare]
  if (likely(sz == -1 || sz >= n))
                            ^
include/linux/compiler.h:152:40: note: in definition of macro ‘likely’
 # define likely(x) __builtin_expect(!!(x), 1)
                                        ^
  CC [M]  /var/lib/dkms/nvidia/319.23/build/nv-acpi.o
In file included from /usr/src/linux-headers-3.10-0.towo-siduction-amd64/arch/x86/include/asm/bitops.h:514:0,
                 from include/linux/bitops.h:22,
                 from include/linux/kernel.h:10,
                 from include/linux/sched.h:15,
                 from include/linux/utsname.h:5,
                 from /var/lib/dkms/nvidia/319.23/build/nv-linux.h:46,
                 from /var/lib/dkms/nvidia/319.23/build/nv-acpi.c:15:
include/linux/bitops.h: In function ‘hweight_long’:
include/asm-generic/bitops/const_hweight.h:27:70: warning: signed and unsigned type in conditional expression [-Wsign-compare]
 #define hweight64(w) (__builtin_constant_p(w) ? __const_hweight64(w) : __arch_hweight64(w))
                                                                      ^
include/linux/bitops.h:66:41: note: in expansion of macro ‘hweight64’
  return sizeof(w) == 4 ? hweight32(w) : hweight64(w);
                                         ^
In file included from /usr/src/linux-headers-3.10-0.towo-siduction-amd64/arch/x86/include/asm/cpumask.h:4:0,
                 from /usr/src/linux-headers-3.10-0.towo-siduction-amd64/arch/x86/include/asm/msr.h:10,
                 from /usr/src/linux-headers-3.10-0.towo-siduction-amd64/arch/x86/include/asm/processor.h:20,
                 from /usr/src/linux-headers-3.10-0.towo-siduction-amd64/arch/x86/include/asm/thread_info.h:22,
                 from include/linux/thread_info.h:54,
                 from include/linux/preempt.h:9,
                 from include/linux/spinlock.h:50,
                 from include/linux/seqlock.h:29,
                 from include/linux/time.h:5,
                 from include/uapi/linux/timex.h:56,
                 from include/linux/timex.h:56,
                 from include/linux/sched.h:17,
                 from include/linux/utsname.h:5,
                 from /var/lib/dkms/nvidia/319.23/build/nv-linux.h:46,
                 from /var/lib/dkms/nvidia/319.23/build/nv-acpi.c:15:
include/linux/cpumask.h: In function ‘cpumask_parse’:
include/linux/cpumask.h:603:26: warning: signed and unsigned type in conditional expression [-Wsign-compare]
  int len = nl ? nl - buf : strlen(buf);
                          ^
In file included from include/uapi/linux/stddef.h:1:0,
                 from include/linux/stddef.h:4,
                 from /usr/src/linux-headers-3.10-0.towo-siduction-amd64/include/uapi/linux/posix_types.h:4,
                 from include/uapi/linux/types.h:13,
                 from include/linux/types.h:5,
                 from include/uapi/linux/capability.h:16,
                 from include/linux/capability.h:15,
                 from include/linux/sched.h:13,
                 from include/linux/utsname.h:5,
                 from /var/lib/dkms/nvidia/319.23/build/nv-linux.h:46,
                 from /var/lib/dkms/nvidia/319.23/build/nv-acpi.c:15:
/usr/src/linux-headers-3.10-0.towo-siduction-amd64/arch/x86/include/asm/uaccess_64.h: In function ‘copy_from_user’:
/usr/src/linux-headers-3.10-0.towo-siduction-amd64/arch/x86/include/asm/uaccess_64.h:62:28: warning: comparison between signed and unsigned integer expressions [-Wsign-compare]
  if (likely(sz == -1 || sz >= n))
                            ^
include/linux/compiler.h:152:40: note: in definition of macro ‘likely’
 # define likely(x) __builtin_expect(!!(x), 1)
                                        ^
/var/lib/dkms/nvidia/319.23/build/nv-acpi.c: At top level:
/var/lib/dkms/nvidia/319.23/build/nv-acpi.c:70:9: warning: initialization from incompatible pointer type [enabled by default]
         .remove = nv_acpi_remove,
         ^
/var/lib/dkms/nvidia/319.23/build/nv-acpi.c:70:9: warning: (near initialization for ‘nv_acpi_driver_template.ops.remove’) [enabled by default]
  CC [M]  /var/lib/dkms/nvidia/319.23/build/nv-chrdev.o
In file included from /usr/src/linux-headers-3.10-0.towo-siduction-amd64/arch/x86/include/asm/bitops.h:514:0,
                 from include/linux/bitops.h:22,
                 from include/linux/kernel.h:10,
                 from include/linux/sched.h:15,
                 from include/linux/utsname.h:5,
                 from /var/lib/dkms/nvidia/319.23/build/nv-linux.h:46,
                 from /var/lib/dkms/nvidia/319.23/build/nv-chrdev.c:15:
include/linux/bitops.h: In function ‘hweight_long’:
include/asm-generic/bitops/const_hweight.h:27:70: warning: signed and unsigned type in conditional expression [-Wsign-compare]
 #define hweight64(w) (__builtin_constant_p(w) ? __const_hweight64(w) : __arch_hweight64(w))
                                                                      ^
include/linux/bitops.h:66:41: note: in expansion of macro ‘hweight64’
  return sizeof(w) == 4 ? hweight32(w) : hweight64(w);
                                         ^
In file included from /usr/src/linux-headers-3.10-0.towo-siduction-amd64/arch/x86/include/asm/cpumask.h:4:0,
                 from /usr/src/linux-headers-3.10-0.towo-siduction-amd64/arch/x86/include/asm/msr.h:10,
                 from /usr/src/linux-headers-3.10-0.towo-siduction-amd64/arch/x86/include/asm/processor.h:20,
                 from /usr/src/linux-headers-3.10-0.towo-siduction-amd64/arch/x86/include/asm/thread_info.h:22,
                 from include/linux/thread_info.h:54,
                 from include/linux/preempt.h:9,
                 from include/linux/spinlock.h:50,
                 from include/linux/seqlock.h:29,
                 from include/linux/time.h:5,
                 from include/uapi/linux/timex.h:56,
                 from include/linux/timex.h:56,
                 from include/linux/sched.h:17,
                 from include/linux/utsname.h:5,
                 from /var/lib/dkms/nvidia/319.23/build/nv-linux.h:46,
                 from /var/lib/dkms/nvidia/319.23/build/nv-chrdev.c:15:
include/linux/cpumask.h: In function ‘cpumask_parse’:
include/linux/cpumask.h:603:26: warning: signed and unsigned type in conditional expression [-Wsign-compare]
  int len = nl ? nl - buf : strlen(buf);
                          ^
In file included from include/uapi/linux/stddef.h:1:0,
                 from include/linux/stddef.h:4,
                 from /usr/src/linux-headers-3.10-0.towo-siduction-amd64/include/uapi/linux/posix_types.h:4,
                 from include/uapi/linux/types.h:13,
                 from include/linux/types.h:5,
                 from include/uapi/linux/capability.h:16,
                 from include/linux/capability.h:15,
                 from include/linux/sched.h:13,
                 from include/linux/utsname.h:5,
                 from /var/lib/dkms/nvidia/319.23/build/nv-linux.h:46,
                 from /var/lib/dkms/nvidia/319.23/build/nv-chrdev.c:15:
/usr/src/linux-headers-3.10-0.towo-siduction-amd64/arch/x86/include/asm/uaccess_64.h: In function ‘copy_from_user’:
/usr/src/linux-headers-3.10-0.towo-siduction-amd64/arch/x86/include/asm/uaccess_64.h:62:28: warning: comparison between signed and unsigned integer expressions [-Wsign-compare]
  if (likely(sz == -1 || sz >= n))
                            ^
include/linux/compiler.h:152:40: note: in definition of macro ‘likely’
 # define likely(x) __builtin_expect(!!(x), 1)
                                        ^
  CC [M]  /var/lib/dkms/nvidia/319.23/build/nv-cray.o
In file included from /usr/src/linux-headers-3.10-0.towo-siduction-amd64/arch/x86/include/asm/bitops.h:514:0,
                 from include/linux/bitops.h:22,
                 from include/linux/kernel.h:10,
                 from include/linux/sched.h:15,
                 from include/linux/utsname.h:5,
                 from /var/lib/dkms/nvidia/319.23/build/nv-linux.h:46,
                 from /var/lib/dkms/nvidia/319.23/build/nv-cray.c:15:
include/linux/bitops.h: In function ‘hweight_long’:
include/asm-generic/bitops/const_hweight.h:27:70: warning: signed and unsigned type in conditional expression [-Wsign-compare]
 #define hweight64(w) (__builtin_constant_p(w) ? __const_hweight64(w) : __arch_hweight64(w))
                                                                      ^
include/linux/bitops.h:66:41: note: in expansion of macro ‘hweight64’
  return sizeof(w) == 4 ? hweight32(w) : hweight64(w);
                                         ^
In file included from /usr/src/linux-headers-3.10-0.towo-siduction-amd64/arch/x86/include/asm/cpumask.h:4:0,
                 from /usr/src/linux-headers-3.10-0.towo-siduction-amd64/arch/x86/include/asm/msr.h:10,
                 from /usr/src/linux-headers-3.10-0.towo-siduction-amd64/arch/x86/include/asm/processor.h:20,
                 from /usr/src/linux-headers-3.10-0.towo-siduction-amd64/arch/x86/include/asm/thread_info.h:22,
                 from include/linux/thread_info.h:54,
                 from include/linux/preempt.h:9,
                 from include/linux/spinlock.h:50,
                 from include/linux/seqlock.h:29,
                 from include/linux/time.h:5,
                 from include/uapi/linux/timex.h:56,
                 from include/linux/timex.h:56,
                 from include/linux/sched.h:17,
                 from include/linux/utsname.h:5,
                 from /var/lib/dkms/nvidia/319.23/build/nv-linux.h:46,
                 from /var/lib/dkms/nvidia/319.23/build/nv-cray.c:15:
include/linux/cpumask.h: In function ‘cpumask_parse’:
include/linux/cpumask.h:603:26: warning: signed and unsigned type in conditional expression [-Wsign-compare]
  int len = nl ? nl - buf : strlen(buf);
                          ^
In file included from include/uapi/linux/stddef.h:1:0,
                 from include/linux/stddef.h:4,
                 from /usr/src/linux-headers-3.10-0.towo-siduction-amd64/include/uapi/linux/posix_types.h:4,
                 from include/uapi/linux/types.h:13,
                 from include/linux/types.h:5,
                 from include/uapi/linux/capability.h:16,
                 from include/linux/capability.h:15,
                 from include/linux/sched.h:13,
                 from include/linux/utsname.h:5,
                 from /var/lib/dkms/nvidia/319.23/build/nv-linux.h:46,
                 from /var/lib/dkms/nvidia/319.23/build/nv-cray.c:15:
/usr/src/linux-headers-3.10-0.towo-siduction-amd64/arch/x86/include/asm/uaccess_64.h: In function ‘copy_from_user’:
/usr/src/linux-headers-3.10-0.towo-siduction-amd64/arch/x86/include/asm/uaccess_64.h:62:28: warning: comparison between signed and unsigned integer expressions [-Wsign-compare]
  if (likely(sz == -1 || sz >= n))
                            ^
include/linux/compiler.h:152:40: note: in definition of macro ‘likely’
 # define likely(x) __builtin_expect(!!(x), 1)
                                        ^
  CC [M]  /var/lib/dkms/nvidia/319.23/build/nv-drm.o
In file included from /usr/src/linux-headers-3.10-0.towo-siduction-amd64/arch/x86/include/asm/bitops.h:514:0,
                 from include/linux/bitops.h:22,
                 from include/linux/kernel.h:10,
                 from include/linux/sched.h:15,
                 from include/linux/utsname.h:5,
                 from /var/lib/dkms/nvidia/319.23/build/nv-linux.h:46,
                 from /var/lib/dkms/nvidia/319.23/build/nv-drm.c:15:
include/linux/bitops.h: In function ‘hweight_long’:
include/asm-generic/bitops/const_hweight.h:27:70: warning: signed and unsigned type in conditional expression [-Wsign-compare]
 #define hweight64(w) (__builtin_constant_p(w) ? __const_hweight64(w) : __arch_hweight64(w))
                                                                      ^
include/linux/bitops.h:66:41: note: in expansion of macro ‘hweight64’
  return sizeof(w) == 4 ? hweight32(w) : hweight64(w);
                                         ^
In file included from /usr/src/linux-headers-3.10-0.towo-siduction-amd64/arch/x86/include/asm/cpumask.h:4:0,
                 from /usr/src/linux-headers-3.10-0.towo-siduction-amd64/arch/x86/include/asm/msr.h:10,
                 from /usr/src/linux-headers-3.10-0.towo-siduction-amd64/arch/x86/include/asm/processor.h:20,
                 from /usr/src/linux-headers-3.10-0.towo-siduction-amd64/arch/x86/include/asm/thread_info.h:22,
                 from include/linux/thread_info.h:54,
                 from include/linux/preempt.h:9,
                 from include/linux/spinlock.h:50,
                 from include/linux/seqlock.h:29,
                 from include/linux/time.h:5,
                 from include/uapi/linux/timex.h:56,
                 from include/linux/timex.h:56,
                 from include/linux/sched.h:17,
                 from include/linux/utsname.h:5,
                 from /var/lib/dkms/nvidia/319.23/build/nv-linux.h:46,
                 from /var/lib/dkms/nvidia/319.23/build/nv-drm.c:15:
include/linux/cpumask.h: In function ‘cpumask_parse’:
include/linux/cpumask.h:603:26: warning: signed and unsigned type in conditional expression [-Wsign-compare]
  int len = nl ? nl - buf : strlen(buf);
                          ^
In file included from include/uapi/linux/stddef.h:1:0,
                 from include/linux/stddef.h:4,
                 from /usr/src/linux-headers-3.10-0.towo-siduction-amd64/include/uapi/linux/posix_types.h:4,
                 from include/uapi/linux/types.h:13,
                 from include/linux/types.h:5,
                 from include/uapi/linux/capability.h:16,
                 from include/linux/capability.h:15,
                 from include/linux/sched.h:13,
                 from include/linux/utsname.h:5,
                 from /var/lib/dkms/nvidia/319.23/build/nv-linux.h:46,
                 from /var/lib/dkms/nvidia/319.23/build/nv-drm.c:15:
/usr/src/linux-headers-3.10-0.towo-siduction-amd64/arch/x86/include/asm/uaccess_64.h: In function ‘copy_from_user’:
/usr/src/linux-headers-3.10-0.towo-siduction-amd64/arch/x86/include/asm/uaccess_64.h:62:28: warning: comparison between signed and unsigned integer expressions [-Wsign-compare]
  if (likely(sz == -1 || sz >= n))
                            ^
include/linux/compiler.h:152:40: note: in definition of macro ‘likely’
 # define likely(x) __builtin_expect(!!(x), 1)
                                        ^
  CC [M]  /var/lib/dkms/nvidia/319.23/build/nv-gvi.o
In file included from /usr/src/linux-headers-3.10-0.towo-siduction-amd64/arch/x86/include/asm/bitops.h:514:0,
                 from include/linux/bitops.h:22,
                 from include/linux/kernel.h:10,
                 from include/linux/sched.h:15,
                 from include/linux/utsname.h:5,
                 from /var/lib/dkms/nvidia/319.23/build/nv-linux.h:46,
                 from /var/lib/dkms/nvidia/319.23/build/nv-gvi.c:15:
include/linux/bitops.h: In function ‘hweight_long’:
include/asm-generic/bitops/const_hweight.h:27:70: warning: signed and unsigned type in conditional expression [-Wsign-compare]
 #define hweight64(w) (__builtin_constant_p(w) ? __const_hweight64(w) : __arch_hweight64(w))
                                                                      ^
include/linux/bitops.h:66:41: note: in expansion of macro ‘hweight64’
  return sizeof(w) == 4 ? hweight32(w) : hweight64(w);
                                         ^
In file included from /usr/src/linux-headers-3.10-0.towo-siduction-amd64/arch/x86/include/asm/cpumask.h:4:0,
                 from /usr/src/linux-headers-3.10-0.towo-siduction-amd64/arch/x86/include/asm/msr.h:10,
                 from /usr/src/linux-headers-3.10-0.towo-siduction-amd64/arch/x86/include/asm/processor.h:20,
                 from /usr/src/linux-headers-3.10-0.towo-siduction-amd64/arch/x86/include/asm/thread_info.h:22,
                 from include/linux/thread_info.h:54,
                 from include/linux/preempt.h:9,
                 from include/linux/spinlock.h:50,
                 from include/linux/seqlock.h:29,
                 from include/linux/time.h:5,
                 from include/uapi/linux/timex.h:56,
                 from include/linux/timex.h:56,
                 from include/linux/sched.h:17,
                 from include/linux/utsname.h:5,
                 from /var/lib/dkms/nvidia/319.23/build/nv-linux.h:46,
                 from /var/lib/dkms/nvidia/319.23/build/nv-gvi.c:15:
include/linux/cpumask.h: In function ‘cpumask_parse’:
include/linux/cpumask.h:603:26: warning: signed and unsigned type in conditional expression [-Wsign-compare]
  int len = nl ? nl - buf : strlen(buf);
                          ^
In file included from include/uapi/linux/stddef.h:1:0,
                 from include/linux/stddef.h:4,
                 from /usr/src/linux-headers-3.10-0.towo-siduction-amd64/include/uapi/linux/posix_types.h:4,
                 from include/uapi/linux/types.h:13,
                 from include/linux/types.h:5,
                 from include/uapi/linux/capability.h:16,
                 from include/linux/capability.h:15,
                 from include/linux/sched.h:13,
                 from include/linux/utsname.h:5,
                 from /var/lib/dkms/nvidia/319.23/build/nv-linux.h:46,
                 from /var/lib/dkms/nvidia/319.23/build/nv-gvi.c:15:
/usr/src/linux-headers-3.10-0.towo-siduction-amd64/arch/x86/include/asm/uaccess_64.h: In function ‘copy_from_user’:
/usr/src/linux-headers-3.10-0.towo-siduction-amd64/arch/x86/include/asm/uaccess_64.h:62:28: warning: comparison between signed and unsigned integer expressions [-Wsign-compare]
  if (likely(sz == -1 || sz >= n))
                            ^
include/linux/compiler.h:152:40: note: in definition of macro ‘likely’
 # define likely(x) __builtin_expect(!!(x), 1)
                                        ^
  CC [M]  /var/lib/dkms/nvidia/319.23/build/nv-i2c.o
In file included from /usr/src/linux-headers-3.10-0.towo-siduction-amd64/arch/x86/include/asm/bitops.h:514:0,
                 from include/linux/bitops.h:22,
                 from include/linux/kernel.h:10,
                 from include/linux/sched.h:15,
                 from include/linux/utsname.h:5,
                 from /var/lib/dkms/nvidia/319.23/build/nv-linux.h:46,
                 from /var/lib/dkms/nvidia/319.23/build/nv-i2c.c:15:
include/linux/bitops.h: In function ‘hweight_long’:
include/asm-generic/bitops/const_hweight.h:27:70: warning: signed and unsigned type in conditional expression [-Wsign-compare]
 #define hweight64(w) (__builtin_constant_p(w) ? __const_hweight64(w) : __arch_hweight64(w))
                                                                      ^
include/linux/bitops.h:66:41: note: in expansion of macro ‘hweight64’
  return sizeof(w) == 4 ? hweight32(w) : hweight64(w);
                                         ^
In file included from /usr/src/linux-headers-3.10-0.towo-siduction-amd64/arch/x86/include/asm/cpumask.h:4:0,
                 from /usr/src/linux-headers-3.10-0.towo-siduction-amd64/arch/x86/include/asm/msr.h:10,
                 from /usr/src/linux-headers-3.10-0.towo-siduction-amd64/arch/x86/include/asm/processor.h:20,
                 from /usr/src/linux-headers-3.10-0.towo-siduction-amd64/arch/x86/include/asm/thread_info.h:22,
                 from include/linux/thread_info.h:54,
                 from include/linux/preempt.h:9,
                 from include/linux/spinlock.h:50,
                 from include/linux/seqlock.h:29,
                 from include/linux/time.h:5,
                 from include/uapi/linux/timex.h:56,
                 from include/linux/timex.h:56,
                 from include/linux/sched.h:17,
                 from include/linux/utsname.h:5,
                 from /var/lib/dkms/nvidia/319.23/build/nv-linux.h:46,
                 from /var/lib/dkms/nvidia/319.23/build/nv-i2c.c:15:
include/linux/cpumask.h: In function ‘cpumask_parse’:
include/linux/cpumask.h:603:26: warning: signed and unsigned type in conditional expression [-Wsign-compare]
  int len = nl ? nl - buf : strlen(buf);
                          ^
In file included from include/uapi/linux/stddef.h:1:0,
                 from include/linux/stddef.h:4,
                 from /usr/src/linux-headers-3.10-0.towo-siduction-amd64/include/uapi/linux/posix_types.h:4,
                 from include/uapi/linux/types.h:13,
                 from include/linux/types.h:5,
                 from include/uapi/linux/capability.h:16,
                 from include/linux/capability.h:15,
                 from include/linux/sched.h:13,
                 from include/linux/utsname.h:5,
                 from /var/lib/dkms/nvidia/319.23/build/nv-linux.h:46,
                 from /var/lib/dkms/nvidia/319.23/build/nv-i2c.c:15:
/usr/src/linux-headers-3.10-0.towo-siduction-amd64/arch/x86/include/asm/uaccess_64.h: In function ‘copy_from_user’:
/usr/src/linux-headers-3.10-0.towo-siduction-amd64/arch/x86/include/asm/uaccess_64.h:62:28: warning: comparison between signed and unsigned integer expressions [-Wsign-compare]
  if (likely(sz == -1 || sz >= n))
                            ^
include/linux/compiler.h:152:40: note: in definition of macro ‘likely’
 # define likely(x) __builtin_expect(!!(x), 1)
                                        ^
/var/lib/dkms/nvidia/319.23/build/nv-i2c.c: In function ‘nv_i2c_del_adapter’:
/var/lib/dkms/nvidia/319.23/build/nv-i2c.c:327:14: error: void value not ignored as it ought to be
     osstatus = i2c_del_adapter(pI2cAdapter);
              ^
make[2]: *** [/var/lib/dkms/nvidia/319.23/build/nv-i2c.o] Error 1
make[1]: *** [_module_/var/lib/dkms/nvidia/319.23/build] Error 2
make[1]: Leaving directory `/usr/src/linux-headers-3.10-0.towo-siduction-amd64'
make: *** [modules] Error 2
make: Leaving directory `/var/lib/dkms/nvidia/319.23/build'

Offline clubex

  • User
  • Posts: 265
RE: 3.10 kernel and Nvidia
« Reply #5 on: 2013/07/03, 16:23:16 »
My profound apologies for the double post. Could a moderator please remove one of the posts for me?

Offline towo

  • Global Moderator
  • User
  • *****
  • Posts: 2.308
RE: 3.10 kernel and Nvidia
« Reply #6 on: 2013/07/03, 16:33:37 »
Where you get 319.23?
Ich gehe nicht zum Karneval, ich verleihe nur manchmal mein Gesicht.

Offline dibl

  • siduction community member
  • Global Moderator
  • User
  • *****
  • Posts: 1.925
    • Land of the Buckeye
RE: 3.10 kernel and Nvidia
« Reply #7 on: 2013/07/03, 17:04:48 »
There is no problem with 319.32 on my systems.

Code: [Select]
root@imerabox:/# apt-cache policy nvidia-glx
nvidia-glx:
  Installed: 319.32-0.siduction.1
  Candidate: 319.32-0.siduction.1
  Version table:
 *** 319.32-0.siduction.1 0
        500 http://packages.siduction.org/experimental/ unstable/non-free amd64 Packages
        100 /var/lib/dpkg/status
     304.88-3 0
        500 http://ftp.us.debian.org/debian/ unstable/non-free amd64 Packages
        500 http://http.debian.net/debian/ unstable/non-free amd64 Packages
Asus ROG STRIX X299-E, Core i7-7740X, Nvidia GTX-1060, dual monitors, SSD 860 EVO, 2@WD1003FZEX in BTRFS

Offline clubex

  • User
  • Posts: 265
RE: 3.10 kernel and Nvidia
« Reply #8 on: 2013/07/03, 17:22:18 »
towo:
From the siduction repo

Thanks didbl. I aim to try it later today.

Offline musca

  • Global Moderator
  • User
  • *****
  • Posts: 725
  • sid, fly high!
RE: 3.10 kernel and Nvidia
« Reply #9 on: 2013/07/03, 22:29:41 »
Hi clubex!
towo` has uploaded two new nvidia drivers:
325.08 beta in siduction experimental
304.88 [patched] in sicuction fixes

Code: [Select]

$ LC_ALL=C apt-cache policy nvidia-kernel-dkms
nvidia-kernel-dkms:
  Installed: 325.08-0.siduction.1
  Candidate: 325.08-0.siduction.1
  Version table:
 *** 325.08-0.siduction.1 0
        100 http://packages.siduction.org/experimental/ unstable/non-free amd64 Packages
        100 /var/lib/dpkg/status
     319.17-1 0
          1 http://http.debian.net/debian/ experimental/non-free amd64 Packages
     304.88-4.siduction.2 0
        500 http://ftp.spline.de/pub/siduction/fixes/ unstable/non-free amd64 Packages
     304.88-3 0
        500 http://http.debian.net/debian/ unstable/non-free amd64 Packages


greetings
musca
„Es irrt der Mensch, solang er strebt.“  (Goethe, Faust)

Offline clubex

  • User
  • Posts: 265
RE: 3.10 kernel and Nvidia
« Reply #10 on: 2013/07/03, 23:35:19 »
Thanks musca and especially towo:
I discovered 325.08-0-siduction.1 in siduction experimental a short while ago and installed it. So far it seems to function well.

If I get any problems I'll report back.
Code: [Select]

inxi -G
Graphics:  Card: NVIDIA GF119 [GeForce GT 520] X.Org: 1.12.4 driver: nvidia Resolution: 1680x1050@59.9hz
           GLX Renderer: GeForce GT 520/PCIe/SSE2 GLX Version: 4.3.0 NVIDIA 325.08


I'll give it a few hours and then unless anyone objects I'll mark the topic as closed.

Offline michaa7

  • User
  • Posts: 2.126
build error with nvidia 304.88; was RE: 3.10 kernel and N
« Reply #11 on: 2013/07/04, 00:47:06 »
During installation I get an build error:
ERROR: Bad return status for modul build on kernel 3.10-0 ...

In "/var/lib/...../make.log" I see at the end:

Quote
...
cc1: some warnings being treated as errorsnv-procfs.o
make[2]: *** [/var/lib/dkms/nvidia/304.88/build/nv-procfs.o] Fehler 1
make[1]: *** [_module_/var/lib/dkms/nvidia/304.88/build] Fehler 2
make[1]: Leaving directory `/usr/src/linux-headers-3.10-0.towo-siduction-686'
make: *** [modules] Fehler 2
make: Leaving directory `/var/lib/dkms/nvidia/304.88/build'


As the complete log is rather long, I didn't want do post it here. If you tell me what I should look for or where to post the log I'll do it.
Ok, you can't code, but you still might be able to write a bug report for Debian's sake

Offline towo

  • Global Moderator
  • User
  • *****
  • Posts: 2.308
RE: build error with nvidia 304.88; was RE: 3.10 kernel and
« Reply #12 on: 2013/07/04, 11:03:35 »
apt-cache policy nvidia-kernel-dkms
Ich gehe nicht zum Karneval, ich verleihe nur manchmal mein Gesicht.

Offline michaa7

  • User
  • Posts: 2.126
RE: build error with nvidia 304.88; was RE: 3.10 kernel and
« Reply #13 on: 2013/07/04, 13:56:01 »
Quote
# apt-cache policy nvidia-kernel-dkms
nvidia-kernel-dkms:
  Installiert:           304.88-4.siduction.2
  Installationskandidat: 304.88-4.siduction.2
  Versionstabelle:
     319.17-1 0
          1 http://ftp.de.debian.org/debian/ experimental/non-free i386 Packages
 *** 304.88-4.siduction.2 0
        900 http://packages.siduction.org/fixes/ unstable/non-free i386 Packages
        100 /var/lib/dpkg/status
     304.88-3 0
        900 http://http.debian.net/debian/ sid/non-free i386 Packages
        500 http://ftp.de.debian.org/debian/ testing/non-free i386 Packages
     304.88-1+deb7u1 0
        500 http://ftp.nl.debian.org/debian/ stable/non-free i386 Packages
Ok, you can't code, but you still might be able to write a bug report for Debian's sake

Offline spacepenguin

  • User
  • Posts: 863
    • spacepenguin.de
RE: build error with nvidia 304.88; was RE: 3.10 kernel and
« Reply #14 on: 2013/07/04, 15:08:48 »
Der 304.88-4.siduction.2 will hier auch nicht mit dem 3.10er Kernel, bin grad wieder mit dem 3.9-4.towo.1-siduction-amd64 unterwegs, der 3.10er führt ins Schwarze, sprich, nur an den Login-Prompt. Und wenn ich nvidia-driver installiere, wird der 319.17 installiert... und der will auch nicht.
Susan | Hardware: SysProfile
Music-Profile: http://www.last.fm/de/user/spacepengu